COGNOME,NOME,UNITA' OPERATIVA,TIPOLOGIA INCARICO,ESTREMI ATTO DI CONFERIMENTO,CURRICULUM,DICHIARAZIONE INCONFERIBILITA' E INCOMPATIBILITA',MODELLO A - DICHIARAZIONE SOST. DEI TITOLARI INCARICHI DIRIGENZIALI,MODELLO B - SITUAZIONE PATRIMONIALE,MODELLO C - DINIEGO,DICHIARAZIONE DEI REDDITI,Stato
CORMIO,GENNARO,SSD GINECOLOGIA ONCOLOGICA,RESPONSABILE SSD GINECOLOGIA ONCOLOGIACA,cormio.pdf,,cormio 2022,,,,,Approvato
ANGIULLI,VITO,SSD CONTROLLO DI GESTIONE,Incarico di Responsabile della Struttura Semplice Dipartimentale “Controllo di Gestione”,ANGIULLI,,ANGIULLI 2021,,,,,Approvato
UGENTI,IPPAZIO,SSD Gastroenterologia-Endoscopia Digestiva,incarico di Responsabile della Struttura Semplice Dipartimentale di “Endoscopia Digestiva”,UGENTI 2020,,UGENTI 2021,,,,,Approvato
SAVINO,EUFEMIA,SSD PATOLOGIA CLINICA,Responsabile della Struttura Semplice Dipartimentale di “Patologia Clinica”,SAVINO,,savino 2021,,,,,Approvato
LENTINI,MARIA CARMELA,S.C. “Area Gestione Risorse Finanziarie ”,Dirigente Amministrativo Sruttura Complessa,lentini,lentini 2020,"lentini 2020, LENTINI 2021",,,,,Approvato
DI LAURO,ALESSANDRA,S.S. di Otorinolaringoiatria e Chirurgia Cervico Maxillo Facciale,Responsabile della Struttura Semplice di Otorinolaringoiatria e Chirurgia Cervico Maxillo Facciale,"di lauro 2, di lauro 1",,"dilauro 2020, di lauro 2021",,,,,Approvato
GUARINI,ATTILIO,DIRETTORE DIPARTIMENTO AREA MEDICA,,GUARINI DIPARTIMENTO AREA MEDICA,,,,,,,Approvato
GADALETA COSMO DAMIANO,COSMO DAMIANO,Interim di Direttore della Struttura Complessa “Radiologia Diagnostica” al Dott. Cosmo Damiano Gadaleta,,INTERIM RADIOLOGIA,,,,,,,Approvato
PECE,ANTONIA,CLINICAL RISK MANAGEMENT,STRUTTURA SEMPLICE,PECE,,pece 2021,,,,,Approvato
PALMIOTTI,GENNARO MARIA,SSD ONCOLOGIA MEDICA PER LA PRESA IN CARICO GLOBALE DEL PAZIENTE,INCARICO DI STRUTTURA SEMPLICE DIPARTIMENTALE,palmiotti.pdf,,,,,,,Approvato
TOMMASI,STEFANIA,SSD DIAGNOSTICA MOLECOLARE E FARMACOGENETICA,INCARICO DI STRUTTURA SEMPLICE,tommasi,TOMMASI 2020,"TOMMASI 2020, TOMMASI 2021",,,,,Approvato
TRAGNI,FILIPPO,SSD PATRIMONIO APPALTI E CONTRATTI,INCARICO DI STRUTTURA SEMPLICE DIPARTIMENTALE ART.18,TRAGNI 2019,TRAGNI,"TRAGNI 2018, TRAGNI 2019, tragni 2020, TRAGNI FILIPPO 2016.pdf, TRAGNI 2021",TRAGNI 2019 BIS,delibera anac 382 del 16 aprile 2017.pdf,,delibera anac 382 del 16 aprile 2017.pdf,Approvato
NAPOLI,GAETANO,SS CHIRURGIA TORACICA MINIVASIVA,INCARICO DI STRUTTURA SEMPLICE,"NAPOLI, NAPOLI 2",napoli 2020,"NAPOLI 2018, napoli 2020, napoli 2021",NAPOLI,,,,Approvato
GUIDA,MICHELE,SS TUMORI RARI E MELANOMA,INCARICO DI STRUTTURA SEMPLICE,GUIDA,guida 2020,"guida 2020, guida 2021",,,,,Approvato
PASTENA,MARIA,S.S.DIAGNOSTICA SENOLOGICA,INCARICO DI STRUTTURA SEMPLICE,PASTENA,pastena 2020,"pastena 2018, pastena 2020, PASTENA 2021",,,,,Approvato
CISTERNINO,MARCO LUIGI,S.S.D.ENDOSCOPIA BRONCHIALE,INCARICO DI STRUTTURA SEMPLICE DIPARTIMENTALE,CISTERNINO,,"cisternino 2018, cisternino 2021",,,,,Approvato
BOTTICELLA,MARIA ANTONIETTA,S.S.“Diagnostica Polmonare”,INCARICO DI STRUTTURA SEMPLICE,BOTTICELLA,BOTTICELLA,"BOTTICELLA, botticella 2018, BOTTICELLA 2021",BOTTICELLA,,,,Approvato
GIOCOLI NACCI,GIANFRANCO,SSD UROLOGIA,Incarico di Struttura Semplice Dipartimentale,GIOCOLI NACCI,/329996009,"GIOCOLI NACCI 2017, GIOCOLI NACCI 2018, GIOCOLI NACCI 2021",GIOCOLI NACCI,delibera anac 382 del 16 aprile 2017.pdf,,delibera anac 382 del 16 aprile 2017.pdf,Approvato
ZITO,FRANCESCO ALFREDO,DIPARTIMENTO DEI SERVIZI,DIRETTORE DI DIPARTIMENTO,DELIB. 506,,,,,,,Approvato
GADALETA,COSMO DAMIANO,DIPARTIMENTO DI DIAGNOSI E TERAPIA PER IMMAGINI,DIRETTORE DI DIPARTIMENTO,DELIBERA N.240,/329996003,"GADALETA 2016, GADALETA CD 2021",GADALETA 2017,,,,Approvato
MILELLA,PIETRO,DIPARTIMENTO DI STAFF,DIRETTORE DI DIPARTIMENTO,DELIBERA N.240,,MILELLA 2017,MILELLA,,,,Approvato
SALOMONE,GIANCARLO,DIPARTIMENTO DELLA GESTIONE,DIRETTORE DI DIPARTIMENTO,DELIBERA N.240,,Salomone 2017,Salomone Giancarlo,,,,Approvato
RESSA,COSMO MAURIZIO,SSD CHIRURGIA PLASTICA E RICOSTRUTTIVA,INCARICO DI STRUTTURA SEMPLICE DIPARTIMENTALE,RESSA 2019,ressa 2020,"RESSA 2017, RESSA 2019, RESSA 2021",ressa 2020,,,,Approvato
DIOTAIUTI,SERGIO,SSD CHIRURGIA GENERALE AD INDIRIZZO SENOLOGICO,INCARICO DI STRUTTURA SEMPLICE DIPARTIMENTALE,DIOTAIUTI.pdf,,,,,,,Approvato
CARRAVETTA,GIUSEPPE,SC ANESTESIA RIANIMAZIONE E TIPO,INCARICO DI STRUTTURA COMPLESSA,del. 217,carravetta 2020,"carravetta 2020, carravetta 2021",carravetta.pdf,,,,Approvato
SIMONE,MICHELE,SC CHIRURGIA GENERALE AD INDIRIZZO ONCOLOGICO,INCARICO DI STRUTTURA COMPLESSA,del. 217,/329996015,"simone 2017, simone 2018, simone 2020",simone.pdf,,,,Approvato
DIDONNA,VITTORIO,SSD FISICA SANITARIA,INCARICO DI STRUTTURA SEMPLICE DIPARTIMENTALE,DIDONNA.pdf,didonna 2020,"didonna 2020, didonna 2021",didonna.pdf,,,,Approvato
DENTAMARO,ROSALBA,SSD RADIOLOGIA SENOLOGICA,INCARICO DI STRUTTURA SEMPLICE DIPARTIMENTALE,DENTAMARO.pdf,/329995997,DENTAMARO 2016,,,,,Approvato
OLIVA,STEFANO,SSD CARDIOLOGIA,INCARICO DI STRUTTURA SEMPLICE DIPARTIMENTALE,OLIVA 2019,oliva 2020,oliva 2020,,,,,Approvato
LIOCE,MARCO,SC RADIOTERAPIA ONCOLOGICA,INCARICO DI STRUTTURA SEMPLICE A VALENZA DIPARTIMENTALE,lioce.pdf,lioce 2020,"lioce.pdf, LIOCE 2017, LIOCE 2018, lioce 2020, lioce 2021",lioce,delibera anac 382 del 16 aprile 2017.pdf,,delibera anac 382 del 16 aprile 2017.pdf,Approvato
RANIERI,GIROLAMO,SS ONCOLOGIA MEDICA INTEGRATA,INCARICO DI STRUTTURA SEMPLICE,RANIERI.pdf,,"ranieri 2021, RANIERI 2016",,,,,Approvato
GADALETA,COSMO,SC ONCOLOGIA INTERVENTISTICA,INCARICO DI STRUTTURA COMPLESSA,del. 217,/329996003,"gadaleta 2017, GADALETA 2021, GADALETA 2016",,,,,Approvato
GUARINI,ATTILIO,SC EMATOLOGIA,INCARICO DI STRUTTURA COMPLESSA,GUARINI SC EMATOLOGIA,,,,delibera anac 382 del 16 aprile 2017.pdf,,delibera anac 382 del 16 aprile 2017.pdf,Approvato
GALETTA,DOMENICO,SSD ONCOLOGIA MEDICA PER LA PATOLOGIA TORACICA,INCARICO DI STRUTTURA SEMPLICE DIPARTIMENTALE,GALETTA.pdf,Galetta 2020,"galetta 2017, GALETTA 2016, galetta 2018, galetta 2020, galetta 2021",galetta.pdf,,,,Approvato
PARADISO,ANGELO,SSD ONCOLOGIA MEDICA AD INDIRIZZO SPERIMENTALE E GESTIONE BIOBANCA,INCARICO DI STRUTTURA SEMPLICE DIPARTIMENTALE,paradiso 2,paradiso 2020,"paradiso 2018, paradiso 2021, paradiso 2020",,,,,Approvato
LORUSSO,VITO,SC ONCOLOGIA MEDICA,INCARICO DI STRUTTURA COMPLESSA,del. 217,/329995971,"lorusso 2017, LORUSSO 2016, LORUSSO 2019, LORUSSO 2019, lorusso 2021",LORUSSO 2019,,,,Approvato
SALOMONE,GIANCARLO,"SC AREA TECNICA, SPP, ICT E HTA",INCARICO DI STRUTTURA COMPLESSA,DEL 236,salomone 2020,"Salomone 2017, salomone 2020",Salomone Giancarlo,,,,Approvato
MADARO,DONATO,SC AREA GESTIONE RISORSE UMANE,INCARICO DI STRUTTURA COMPLESSA,DEL 236,madaro.pdf,"madaro 2018, MADARO 2019, MADARO 2016, madaro 2020, madaro 2021",MADARO 2019,,,,Approvato
NARDULLI,PATRIZIA,SC FARMACIA E UMACA,INCARICO DI STRUTTURA COMPLESSA,NARDULLI.pdf,nardulli 2020,"NARDULLI 2018, nardulli 2021, nardulli 2017, nardulli 2020, NARDULLI 2021",nardulli.pdf,,,,Approvato
MILELLA,PIETRO,SC UOSE CONTROLLO GESTIONE E QUALITA',INCARICO DI STRUTTURA COMPLESSA,del. 217,,"MILELLA 2016, MILELLA 2017, MILELLA 2016",MILELLA,,,,Approvato
GRIMALDI,MARIA,"SC AFFARI GENERALI, STRUTTURA BUROCRATICO LEGALE E PRIVACY",INCARICO DI STRUTTURA COMPLESSA,GRIMALDI 2018,GRIMALDI 2020,"GRIMALDI 2018, GRIMALDI 2021",,,,,Approvato
